{"text_format":"1","workbook":"xlsx","n_sheets":4,"sheets":["FORM","URL SOURCES","DIARY","lookuptables"],"not_rendered":{"charts":0,"images":0,"macros":1,"external_links":0,"defined_names":0,"comments":0,"pivot_tables":0},"unopened":[],"bounds":{"document_bytes":16777216,"sheet_cells":100000,"rows_first":2000,"rows_last":500,"rows_between":2000,"halvings":0,"cell_chars":16384,"cell_head_chars":4096},"cells_cut":0,"cells_raw":0,"read":"whole","date_system":"1900"}

{"sheet":"FORM","index":0,"n_rows":103,"n_cols":9,"rows_kept":103,"cut":false,"hidden":false,"merged":[[27,5,28,5],[0,0,0,2],[1,0,1,2],[2,0,2,2],[27,1,28,1],[27,2,28,2],[27,3,28,3],[27,4,28,4]]}
["WHAT CAN YOU DO ABOUT CLIMATE CHANGE?"]
["Operation Unite® Climate Change Tool"]
["Operation Unite®, POB 922, Nevada City, CA  95959; 530-478-1260; www.operationunite.co"]
[]
["DIRECTIONS FOR USING THIS SPREADSHEET."]
[null,"Muse over the questions listed below."]
[null,"Explore the general sources of Climate Change and related URLs (see Sources block below)."]
[null,"Prioritize the items on the list below according to immediacy of action (implement within the next); 1 now; 2 within the next six months; 3 within the next year; 4 within the next two years; 5 within the next five years. "]
[null,"Sort the prioritized actions from 1 to 5."]
[null,"Now you have a Climate Change bucket list. Start making changes beginning with No. 1 and working through the priorities."]
[null,"Document your changes with pictures, short videos or audio."]
[null,"Keep a diary (see spreadsheet \"DAIRY\")."]
[null,"Let Operation Unite know about your successes. We will post your success on the Operation Unite website and, possibly, interview you on our YouTube or radio channels."]
[null,null,null,null,null,"ACTION TYPES"]
["Here are some questions to ask yourself.",null,null,null,null,"        1  Eating"]
[null,"What can I do to stay comfortable when summer temperatures really get high?",null,null,null,"        2  Energy Improvement"]
[null,"What can I do to protect my property and neighboring properties from flooding during extreme rain storms?",null,null,null,"        3  Transportation"]
[null,"How can I protect my property from fire?",null,null,null,"        4  Education"]
[null,"How can I anticipate extreme weather?",null,null,null,"        5  Activism"]
[null,"What do I need to do to prepare for big storms?",null,null,null,"        6  Communication"]
[null,"Where can I learn more about Climate Change impacting me directly and also the current world?",null,null,null,"        7  Water"]
[null,"Who should be my network of elected officials and how often should I contact them?",null,null,null,"        8  Emergency"]
[null,"What daily changes do I need to make for reducing the rate of warming?",null,"CONTACT OPERATION UNITE®",null,"        9  Domestic Habits"]
[null,null,null,null,null,"        10  Health"]
[]
[]
[]
[null,"PRIORITY","ACTION","REASON","ACTION TYPE","SOURCE OF INFORMATION"]
[null,null,null,null,null,null,null,"C OR P","TYPE OF ACTION"]
[null,null,"Contact your mayor and ask for an assessment and Climate Change Action Plan.","Create community change that prepares your entire community and help implement it.",{"$f":"VLOOKUP(I30,lookuptables!$A$2:$B$11,2,FALSE)","v":"Activism"},"http://climatecommunication.yale.edu/publications/the-genesis-of-climate-change-activism/",null,"community",5]
[null,null,"Encourage diversification of water sources in your community.","All water supplies have vulnerabilities to being damaged or not available. Campaign with your local water purveyors to have a diversified number of water sources and a conveyance system that is adaptable and flexible. Vulnerability will be substantially lessed with this approach.",{"$f":"VLOOKUP(I31,lookuptables!$A$2:$B$11,2,FALSE)","v":"Activism"},"https://www.epa.gov/arc-x/strategies-climate-change-adaptation",null,"community",5]
[null,null,"Motivate your community, through service clubs, Board of Supervisors, mayor, school districts to develop a climate action plan.","We are all in this together. Groups can make big improvements in your community so get together.",{"$f":"VLOOKUP(I32,lookuptables!$A$2:$B$11,2,FALSE)","v":"Activism"},"http://climatecommunication.yale.edu/publications/the-genesis-of-climate-change-activism/",null,"community",5]
[null,null,"Campaign your electricity/gas utility to switch to clean and renewable power.","Use wind and solar or other power sources that don't have an ongoing greenhouse gas footprint.",{"$f":"VLOOKUP(I33,lookuptables!$A$2:$B$11,2,FALSE)","v":"Activism"},"https://www.climateactioncampaign.org/5fights/clean-energy/",null,"community",5]
[null,null,"Contact your Couty/Borough/Townwhip and ask for an assessment and Climate Change Action Plan.","Create community change that prepares your entire community and help implement it.",{"$f":"VLOOKUP(I34,lookuptables!$A$2:$B$11,2,FALSE)","v":"Activism"},"http://climatecommunication.yale.edu/publications/the-genesis-of-climate-change-activism/",null,"community",5]
[null,null,"Contact your governor and ask for an assessment and Climate Change Action Plan.","Create community change that prepares your entire community and help implement it.",{"$f":"VLOOKUP(I35,lookuptables!$A$2:$B$11,2,FALSE)","v":"Activism"},"http://climatecommunication.yale.edu/publications/the-genesis-of-climate-change-activism/",null,"community",5]
[null,null,"Contact your State Senator and ask for an assessment and Climate Change Action Plan.","Create community change that prepares your entire community and help implement it.",{"$f":"VLOOKUP(I36,lookuptables!$A$2:$B$11,2,FALSE)","v":"Activism"},"http://climatecommunication.yale.edu/publications/the-genesis-of-climate-change-activism/",null,"community",5]
[null,null,"Contact your State Assemblyperson and ask for an assessment and Climate Change Action Plan.","Create community change that prepares your entire community and help implement it.",{"$f":"VLOOKUP(I37,lookuptables!$A$2:$B$11,2,FALSE)","v":"Activism"},"http://climatecommunication.yale.edu/publications/the-genesis-of-climate-change-activism/",null,"community",5]
[null,null,"Contact your Federal Senator and ask for an assessment and Climate Change Action Plan.","Create community change that prepares your entire community and help implement it.",{"$f":"VLOOKUP(I38,lookuptables!$A$2:$B$11,2,FALSE)","v":"Activism"},"http://climatecommunication.yale.edu/publications/the-genesis-of-climate-change-activism/",null,"community",5]
[null,null,"Contact your Federal Assemblyperson and ask for an assessment and Climate Change Action Plan.","Create community change that prepares your entire community and help implement it.",{"$f":"VLOOKUP(I39,lookuptables!$A$2:$B$11,2,FALSE)","v":"Activism"},"http://climatecommunication.yale.edu/publications/the-genesis-of-climate-change-activism/",null,"community",5]
[null,null,"Ask Fereral and State Senators and Assemblypersons for research, development and subsidies for renewable energy.","The science does not have a perfect understanding and new situations are constantly being discovered regarding climate change consequences. It is a work in progress.",{"$f":"VLOOKUP(I40,lookuptables!$A$2:$B$11,2,FALSE)","v":"Activism"},"http://climatecommunication.yale.edu/publications/the-genesis-of-climate-change-activism/",null,"community",5]
[null,null,"Start a tree planting campaign in your community.","Think big. Trees absorb carbon dioxide and emit oxygen. Need a lot more trees to compensate for the increases in carbon dioxide and the absorption of carbon dioxide already present in the atmostphere.",{"$f":"VLOOKUP(I41,lookuptables!$A$2:$B$11,2,FALSE)","v":"Activism"},"http://www.un.org/climatechange/blog/2014/08/plant-planet-billion-tree-campaign/",null,"community",5]
[null,null,"Support community projects for upgrading water supply and stormwater and recycled water.","Some of the responses to a changing climate require a big, expensive effort. Raising our sewer and storm systems is one of these. New treated water pipes is also needed to end the huge loss of water that is happening right now. Bridges and roads along certain areas of our coasts require raising otherwise they will be either underwater or will prevent passage from underneath.",{"$f":"VLOOKUP(I42,lookuptables!$A$2:$B$11,2,FALSE)","v":"Activism"},"https://www.ncbi.nlm.nih.gov/pmc/articles/PMC3262001/",null,"personal",5]
[null,null,"Support water injection projects that fill aquifers.","Our future is filled with extreme weather events both water plenty and water scarce. Flood waters need to be redirected to areas where the groundwater aquifers are being emptied. These aquifers are not going to refill at the rate that people rely on them. We pump way too much water from the ground.",{"$f":"VLOOKUP(I43,lookuptables!$A$2:$B$11,2,FALSE)","v":"Activism"},"https://www.epa.gov/sites/production/files/2016-04/documents/fema_aquifer_storage_recovery_fact_sheet-sept_2015.pdf",null,"personal",5]
[null,null,"Raise bridges near coastal areas.","Some of the responses to a changing climate require a big, expensive effort. Raising our sewer and storm systems is one of these. New treated water pipes is also needed to end the huge loss of water that is happening right now. Bridges and roads along certain areas of our coasts require raising otherwise they will be either underwater or will prevent passage from underneath.",{"$f":"VLOOKUP(I44,lookuptables!$A$2:$B$11,2,FALSE)","v":"Activism"},"http://www.pjstar.com/news/20170606/climate-change-raises-new-risk-are-inland-bridges-too-low",null,"community",5]
[null,null,"Fortify shoreline protection from erosion.","Ocean surges are already happening at a lot greater intensities and frequencies. We don't want our homes and communities to wash away. Stay ahead of this very serious natural disaster.",{"$f":"VLOOKUP(I45,lookuptables!$A$2:$B$11,2,FALSE)","v":"Activism"},"http://www.ecy.wa.gov/climatechange/2012ccrs/coasts.htm",null,"community",5]
[null,null,"Campaign for building \"cool surfaces\" for roads in your community.","Reflecting heat into the atmosphere instead of getting absorbed by the land surface materials will yield lower temperatures at the ground surface which require less power for air conditioning and other detrimental consequences to high temperatures.",{"$f":"VLOOKUP(I46,lookuptables!$A$2:$B$11,2,FALSE)","v":"Activism"},"https://www.epa.gov/cira/climate-action-benefits-roads",null,"community",5]
[null,null,"Video conference or other internet options instead of traveling for business meetings.","You don't have to travel for all business and personal activities. Use less fuel.",{"$f":"VLOOKUP(I47,lookuptables!$A$2:$B$11,2,FALSE)","v":"Communication"},"https://www.scientificamerican.com/article/can-videoconferencing-replace-travel/",null,"personal",6]
[null,null,"Don't leave your refrigerator door open when getting food and drinks.","If your home and business location is efficient on it heating needs, you will be using a lot less fuel to keep it warm and cool.",{"$f":"VLOOKUP(I48,lookuptables!$A$2:$B$11,2,FALSE)","v":"Domestic Habit"},"https://www.energystar.gov/campaign/waysToSave#!card30-GW74",null,"personal",9]
[null,null,"Fix broken items instead of buying a new one.","New products requires energy to produce. Recycle & reuse.",{"$f":"VLOOKUP(I49,lookuptables!$A$2:$B$11,2,FALSE)","v":"Domestic Habit"},"https://www.treehugger.com/green-home/quick-fix-10-things-you-can-repair-under-10-minutes.html",null,"personal",9]
[null,null,"Cover your pots while cooking.","It is more efficient to cover pots while heating your food otherwise the heat generated by your stove will also heat up the room which is not your objective. Be wise. Be efficient. Use less fuel.",{"$f":"VLOOKUP(I50,lookuptables!$A$2:$B$11,2,FALSE)","v":"Domestic Habit"},"https://www.energystar.gov/about/newsroom/the-energy-source/simple_tips_cooking_savings",null,"personal",9]
[null,null,"Actually live in the climate your home is located and only modulate the extreme weather days.","Be more connected with the seasons and put a sweater on in the winter and T-shirts/shirtless blouses in the summer. Uses less electricity.",{"$f":"VLOOKUP(I51,lookuptables!$A$2:$B$11,2,FALSE)","v":"Domestic Habit"},"http://www.greenpeace.org/international/en/campaigns/climate-change/Solutions/What-you-can-do/",null,"personal",9]
[null,null,"Go back to the olden days and dry your clothes on a clothes line.","Don't use the clothes dryer. Use less power.",{"$f":"VLOOKUP(I52,lookuptables!$A$2:$B$11,2,FALSE)","v":"Domestic Habit"},"http://content.time.com/time/specials/2007/environment/article/0,28804,1602354_1603074_1603130,00.html",null,"personal",9]
[null,null,"Build a green home. Have a garden.","Rely less on fertilizers and transportation of your food.",{"$f":"VLOOKUP(I53,lookuptables!$A$2:$B$11,2,FALSE)","v":"Domestic Habit"},"http://www.nwf.org/What-We-Do/Energy-and-Climate/Climate-and-Energy/Reduce-Carbon-Pollution/Gardening-for-Climate-Change.aspx",null,"personal",9]
[null,null,"Only use your dishwasher and washing machine when you have a full load.","These machines use the same amout of power for one load so make it count. Fill up the washers completely before running a load.",{"$f":"VLOOKUP(I54,lookuptables!$A$2:$B$11,2,FALSE)","v":"Domestic Habit"},"https://www.nrdc.org/stories/9-tricks-save-tons-water",null,"personal",9]
[null,null,"Take a shower instead of a bath.","Conserve your water use mean less power to maintain the 24/7 water source by your water purveyor.",{"$f":"VLOOKUP(I55,lookuptables!$A$2:$B$11,2,FALSE)","v":"Domestic Habit"},"https://www.eea.europa.eu/green-tips/take-a-shower-rather-than-a-bath",null,"personal",9]
[null,null,"Don't be a throw away consumer. Reuse things like bottles, packaging, etc.","New products requires energy to produce. Recycle & reuse.",{"$f":"VLOOKUP(I56,lookuptables!$A$2:$B$11,2,FALSE)","v":"Domestic Habit"},"https://www.theguardian.com/environment/2017/mar/13/waste-plastic-food-packaging-recycling-throwaway-culture-dave-hall",null,"personal",9]
[null,null,"Don't waste food. Find a use for everything.","Growing food requires, fertilizer, fuel for farming equipment, fuel for transporting to your local store. Don't waste.",{"$f":"VLOOKUP(I57,lookuptables!$A$2:$B$11,2,FALSE)","v":"Domestic Habit"},"https://www.theguardian.com/environment/2016/apr/07/reducing-food-waste-would-mitigate-climate-change-study-shows",null,"community",9]
[null,null,"Use your car less by walking, ride-sharing, biking or choose not to go out.","Use less fuel.",{"$f":"VLOOKUP(I58,lookuptables!$A$2:$B$11,2,FALSE)","v":"Domestic Habit"},"https://whatsyourimpact.org/fight-climate-change/drive-less",null,"personal",9]
[null,null,"If you drive somewhere, go easy on the gas and brake pedals.","Be more fuel efficient in your car. Less fuel, less burning, less emissions that cause climate warming.",{"$f":"VLOOKUP(I59,lookuptables!$A$2:$B$11,2,FALSE)","v":"Domestic Habit"},"http://www.kcra.com/article/5-things-you-can-do-about-climate-change/9970192",null,"personal",9]
[null,null,"Frequently check your tire air pressure.","More efficient use of car means less fuel, less buringk less emissions that cause climate warming.",{"$f":"VLOOKUP(I60,lookuptables!$A$2:$B$11,2,FALSE)","v":"Domestic Habit"},"http://www.environmenthamilton.org/tonnes/calculator/action.php?Action=10",null,"personal",9]
{"$rows_left_out":44}
{"sheet":"URL SOURCES","index":1,"n_rows":17,"n_cols":2,"rows_kept":17,"cut":false,"hidden":false,"merged":[]}
["GENERAL SOURCES RELATED TO CLIMATE CHANGE OTHER SUPPORTIVE INFORMATION FOR YOUR HOUSEHOLD"]
[]
["Founded in 2009 by Stephen Baker, Operation Unite® is a hands – on, results - oriented, capacity building initiative that engages Stakeholders and the Impacted Public in solving water problems thereby building Public responsibility for generated projects.\n\nOur goal is to bring specific communities and the relevant agencies into alignment through the development of common values, collaborative relationships and a shared community plan to achieve articulated goals designed to address the challenges and problems they face. We bring people together to solve water issues through outreach programs like groundwater management and monitoring, awareness campaigns with the public and stakeholders regarding Climate Change, Groundwater Replenishment, Well Fracking,  Rain Water Harvesting, Water Infrastructure, Gray Water, Flood Prevention and Response, Water Recycling, Tunamis Response, Water Reuse, Water shortage, Water Conservation, Water quality, Groundwater management, Sea Level Rise and Homeland Security. Contact Operation Unite at stevebaker@operationunite.co or 530-478-1260.\n","www.operationunite.co"]
["The Intergovernmental Panel on Climate Change (IPCC) is the international body for assessing \nthe science related to climate change. The IPCC was set up in 1988 by the World Meteorological \nOrganization (WMO) and United Nations Environment Programme (UNEP) to provide policymakers \nwith regular assessments of the scientific basis of climate change, its impacts and future risks, and \noptions for adaptation and mitigation. ","http://www.ipcc.ch/"]
["The U.S. Drought Monitor, established in 1999, is a weekly map of drought conditions that is produced jointly by the National Oceanic and Atmospheric Administration, the U.S. Department of Agriculture, and the National Drought Mitigation Center (NDMC) at the University of Nebraska-Lincoln. The U.S. Drought Monitor website is hosted and maintained by the NDMC.","http://droughtmonitor.unl.edu/"]
["From daily weather forecasts, severe storm warnings, and climate monitoring to fisheries management, coastal restoration and supporting marine commerce, NOAA’s products and services support economic vitality and affect more than one-third of America’s gross domestic product. NOAA’s dedicated scientists use cutting-edge research and high-tech instrumentation to provide citizens, planners, emergency managers and other decision makers with reliable information they need when they need it.","http://www.noaa.gov/"]
["The USGS serves the Nation by providing reliable scientific information to describe and understand the Earth; minimize loss of life and property from natural disasters; manage water, biological, energy, and mineral resources; and enhance and protect our quality of life.","https://www.usgs.gov/"]
["The mission of EPA is to protect human health and the environment. EPA's purpose is to ensure that: all Americans are protected from significant risks to human health and the environment where they live, learn and work; national efforts to reduce environmental risk are based on the best available scientific information; federal laws protecting human health and the environment are enforced fairly and effectively; environmental protection is an integral consideration in U.S. policies concerning natural resources, human health, economic growth, energy, transportation, agriculture, industry, and international trade, and these factors are similarly considered in establishing environmental policy; all parts of society -- communities, individuals, businesses, and state, local and tribal governments -- have access to accurate information sufficient to effectively participate in managing human health and environmental risks; environmental protection contributes to making our communities and ecosystems diverse, sustainable and economically productive; and the United States plays a leadership role in working with other nations to protect the global environment.","https://www.epa.gov/"]
["The American Red Cross prevents and alleviates human suffering in the face of emergencies by mobilizing the power of volunteers and the generosity of donors.​","http://www.redcross.org/?scode=RSG00000E017&gclid=Cj0KCQjw--DLBRCNARIsAFIwR243Ii8VD_ELxp82L-HqgaYxHr1EdQEl3NwUnhAiyFuNvhjqzZKhZ-AaAu5REALw_wcB&gclsrc=aw.ds&dclid=CMy7qfTHp9UCFZaOfgodoxILJA"]
["The Salvation Army, an international movement, is an evangelical part of the universal Christian church. Its message is based on the Bible. Its ministry is motivated by the love of God. Its mission is to preach the gospel of Jesus Christ and to meet human needs in His name without discrimination.","https://give.salvationarmyusa.org/site/SPageNavigator/national_donation_form.html?utm_source=Google&utm_medium=cpc&utm_campaign=Google:RedKettleWestern-Brand:Western:California:Sacramento/Stockton/Modesto:Search:Text&cm_mmc=Google-_-Google:RedKettleWestern-Brand:Western:California:Sacramento/Stockton/Modesto:Search:Text-_-Salvation-Army-Brand-_-salvation-army&cm_mmca1=USW&cm_mmca2=Sacramento-Stockton-Modesto&cm_mmca3=Prospecting&gclid=Cj0KCQjw--DLBRCNARIsAFIwR26SKCsOonb4aXaw42sltbH9ZFjmzkURPsHE8NzX0qvfMmKQ8j5Lo_UaAl7pEALw_wcB"]
["United States Department of Agriculture - Groundwater Stewardship","https://www.fs.fed.us/geology/groundwater.php"]
["Drought.gov aims to provide a one-stop shop for current, reliable, and useful information and resources related to drought. We value your feedback. Let us know how you think drought.gov is serving you, how you use drought-related information in decision making, and/or what other resources you would like to see available through drought.gov.","https://www.drought.gov/drought/"]
["Meet the Challenges of a Changing Climate; Find information and tools to help you understand and address your climate risks.","https://toolkit.climate.gov/"]
["The Climate Literacy and Energy Awareness Network (CLEAN) Portal was launched in 2010 as a National Science Digital Library (NSDL) Pathways project. It is led by the science education expertise of TERC, the Cooperative Institute for Research in Environmental Science (CIRES) at the University of Colorado Boulder, and the Science Education Resource Center (SERC) at Carleton College. As of 2012, CLEAN has been syndicated to NOAA's climate.gov portal. CLEAN's primary effort is to steward the collection of climate and energy science educational resources and to support a community of professionals committed to improving climate and energy literacy.","https://cleanet.org/index.html"]
["The Pacific Institute is a global water think tank that provides science-based thought leadership with active outreach to influence local, national, and international efforts in developing sustainable water policies. Since 1987, we have worked with everyone from Fortune 500 companies to disenfranchised communities to create and advance sustainable water policies and deliver meaningful results","http://pacinst.org/"]
["Western U.S. Climate Historical Summaries","https://wrcc.dri.edu/Climsum.html"]
["The Alliance for Water Efficiency is a stakeholder-based nonprofit organization dedicated to the efficient and sustainable use of water. Headquartered in Chicago, the Alliance serves as a North American advocate for water efficient products and programs, and provides information and assistance on water conservation efforts. A diverse Board of Directors governs the organization and has adopted a set of guiding principles and strategic plan. ","http://www.allianceforwaterefficiency.org/default.aspx"]

{"sheet":"DIARY","index":2,"n_rows":10,"n_cols":5,"rows_kept":10,"cut":false,"hidden":false,"merged":[[6,2,6,3],[0,2,0,3],[1,2,1,3],[2,2,2,3],[3,2,3,3],[4,2,4,3],[5,2,5,3]]}
["Your Name:",null,"Operation Unite"]
["Street Address:",null,"POB 922, Nevada City, California  95959"]
["City:",null,"stevebaker@operationunite.co"]
["State:",null,"530-478-1260"]
["Zip Code:",null,"www.operationunite.co"]
["Phone No.:",null,"Operation Unite Water YouTube channel"]
["Email:",null,"Operation Unite Facebook Page"]
[]
["ACTION DIARY"]
["Date","Action Taken","Insight Gained","Design of Plan to Achieve Insight","Comment"]

{"sheet":"lookuptables","index":3,"n_rows":11,"n_cols":3,"rows_kept":11,"cut":false,"hidden":false,"merged":[[0,0,0,1]]}
["TYPE OF ACTION",null,"PRIORITIES"]
[1,"Eating",1]
[2,"Energy improvement",2]
[3,"Transortation",3]
[4,"Education",4]
[5,"Activism",5]
[6,"Communication"]
[7,"Water"]
[8,"Emergency"]
[9,"Domestic Habit"]
[10,"Health"]